Reaction Details
TargetTyrosine-protein kinase ABL1
LigandBDBM50307768
Substrate/Competitorn/a
Meas. Tech.ChEMBL_612345 (CHEMBL1065597)
IC50 2890±n/a nM
Citation Cai, XZhai, HXWang, JForrester, JQu, HYin, LLai, CJBao, RQian, C Discovery of 7-(4-(3-ethynylphenylamino)-7-methoxyquinazolin-6-yloxy)-N-hydroxyheptanamide (CUDc-101) as a potent multi-acting HDAC, EGFR, and HER2 inhibitor for the treatment of cancer. J Med Chem53:2000-9 (2010) 
 
Tyrosine-protein kinase ABL1
Name:Tyrosine-protein kinase ABL1
Type:Enzyme
Mol. Mass.:122897.30
Organism:Homo sapiens (Human)
Description:P00519
Residue:1130
BDBM50307768
NameBDBM50307768
Synonyms:7-(4-(3-Ethynylphenylamino)-7-methoxyquinazolin-6-yloxy)-N-hydroxyheptanamide CUDC-101
TypeSmall organic molecule
Emp. Form.C24H26N4O4
Mol. Mass.434.4876
SMILESCOc1cc2ncnc(Nc3cccc(c3)C#C)c2cc1OCCCCCCC(=O)NO