Reaction Details
TargetEpidermal growth factor receptor
LigandBDBM50307771
Substrate/Competitorn/a
Meas. Tech.ChEMBL_612309 (CHEMBL1064921)
IC50 9.4±n/a nM
Citation Cai, XZhai, HXWang, JForrester, JQu, HYin, LLai, CJBao, RQian, C Discovery of 7-(4-(3-ethynylphenylamino)-7-methoxyquinazolin-6-yloxy)-N-hydroxyheptanamide (CUDc-101) as a potent multi-acting HDAC, EGFR, and HER2 inhibitor for the treatment of cancer. J Med Chem53:2000-9 (2010) 
 
Epidermal growth factor receptor
Name:Epidermal growth factor receptor
Type:Receptor Kinase Domain
Mol. Mass.:134279.59
Organism:Homo sapiens (Human)
Description:P00533
Residue:1210
BDBM50307771
NameBDBM50307771
Synonyms:5-(4-(3-Chloro-4-fluorophenylamino)-7-methoxyquinazolin-6-yloxy)-N-hydroxypentanamide | CHEMBL596736
TypeSmall organic molecule
Emp. Form.C20H20ClFN4O4
Mol. Mass.434.849
SMILESCOc1cc2ncnc(Nc3ccc(F)c(Cl)c3)c2cc1OCCCCC(=O)NO