Reaction Details
TargetEpidermal growth factor receptor
LigandBDBM50307779
Substrate/Competitorn/a
Meas. Tech.ChEMBL_612309 (CHEMBL1064921)
IC50 15±n/a nM
Citation Cai, XZhai, HXWang, JForrester, JQu, HYin, LLai, CJBao, RQian, C Discovery of 7-(4-(3-ethynylphenylamino)-7-methoxyquinazolin-6-yloxy)-N-hydroxyheptanamide (CUDc-101) as a potent multi-acting HDAC, EGFR, and HER2 inhibitor for the treatment of cancer. J Med Chem53:2000-9 (2010) 
 
Epidermal growth factor receptor
Name:Epidermal growth factor receptor
Type:Receptor Kinase Domain
Mol. Mass.:134279.59
Organism:Homo sapiens (Human)
Description:P00533
Residue:1210
BDBM50307779
NameBDBM50307779
Synonyms:7-(4-(3-chloro-4-fluorophenylamino)-7-methoxyquinazolin-6-ylsulfonyl)-N-hydroxyheptanamide | CHEMBL596755
TypeSmall organic molecule
Emp. Form.C22H24ClFN4O5S
Mol. Mass.510.966
SMILESCOc1cc2ncnc(Nc3ccc(F)c(Cl)c3)c2cc1S(=O)(=O)CCCCCCC(=O)NO