Reaction Details
TargetEpidermal growth factor receptor
LigandBDBM50307789
Substrate/Competitorn/a
Meas. Tech.ChEMBL_612309 (CHEMBL1064921)
IC50 614±n/a nM
Citation Cai, XZhai, HXWang, JForrester, JQu, HYin, LLai, CJBao, RQian, C Discovery of 7-(4-(3-ethynylphenylamino)-7-methoxyquinazolin-6-yloxy)-N-hydroxyheptanamide (CUDc-101) as a potent multi-acting HDAC, EGFR, and HER2 inhibitor for the treatment of cancer. J Med Chem53:2000-9 (2010) 
 
Epidermal growth factor receptor
Name:Epidermal growth factor receptor
Type:Receptor Kinase Domain
Mol. Mass.:134279.59
Organism:Homo sapiens (Human)
Description:P00533
Residue:1210
BDBM50307789
NameBDBM50307789
Synonyms:(R)-7-(4-(1-(4-Chlorophenyl)ethylamino)-7-methoxyquinazolin-6-yloxy)-N-hydroxyheptanamide | CHEMBL598407
TypeSmall organic molecule
Emp. Form.C24H29ClN4O4
Mol. Mass.472.964
SMILESCOc1cc2ncnc(N[C@@H](C)c3ccc(Cl)cc3)c2cc1OCCCCCCC(=O)NO