Reaction Details
TargetFatty-acid amide hydrolase 1 [30-579]
LigandBDBM50307792
Substrate/Competitorn/a
Meas. Tech.ChEMBL_612367 (CHEMBL1065619)
Ki 190±n/a nM
Citation Onnis, VCongiu, CBjörklund, EHempel, FSöderström, EFowler, CJ Synthesis and evaluation of paracetamol esters as novel fatty acid amide hydrolase inhibitors. J Med Chem53:2286-98 (2010) 
 
Fatty-acid amide hydrolase 1 [30-579]
Name:Fatty-acid amide hydrolase 1 [30-579]
Type:Single-pass membrane protein; homodimer
Mol. Mass.:60474.00
Organism:Rattus norvegicus (rat)
Description:P97612 (aa 30-579)
Residue:550
BDBM50307792
NameBDBM50307792
Synonyms:4-Acetamidophenyl 2-(4-(2-(trifluoromethyl)pyridin-4-ylamino)phenyl)acetate | CHEMBL597562
TypeSmall organic molecule
Emp. Form.C22H18F3N3O3
Mol. Mass.429.3918
SMILESCC(=O)Nc1ccc(OC(=O)Cc2ccc(Nc3ccnc(c3)C(F)(F)F)cc2)cc1