Reaction Details
TargetFatty-acid amide hydrolase 1 [30-579]
LigandBDBM26197
Substrate/Competitorn/a
Meas. Tech.ChEMBL_612361 (CHEMBL1065613)
IC50>300000±n/a nM
Citation Onnis, VCongiu, CBjörklund, EHempel, FSöderström, EFowler, CJ Synthesis and evaluation of paracetamol esters as novel fatty acid amide hydrolase inhibitors. J Med Chem53:2286-98 (2010) 
 
Fatty-acid amide hydrolase 1 [30-579]
Name:Fatty-acid amide hydrolase 1 [30-579]
Type:Single-pass membrane protein; homodimer
Mol. Mass.:60474.00
Organism:Rattus norvegicus (rat)
Description:P97612 (aa 30-579)
Residue:550
BDBM26197
NameBDBM26197
Synonyms:CHEMBL112 Norco US9333197, Acetaminophen phenol derivative, 11
TypeSmall organic molecule
Emp. Form.C8H9NO2
Mol. Mass.151.1626
SMILESCC(=O)Nc1ccc(O)cc1