Reaction Details
TargetBcl-2-like protein 1
LigandBDBM50308110
Substrate/Competitorn/a
Meas. Tech.ChEMBL_610765 (CHEMBL1064400)
Ki 3700±n/a nM
Citation Bernardo, PHSivaraman, TWan, KFXu, JKrishnamoorthy, JSong, CMTian, LChin, JSLim, DSMok, HYYu, VCTong, JCChai, CL Structural insights into the design of small molecule inhibitors that selectively antagonize Mcl-1. J Med Chem53:2314-8 (2010) 
 
Bcl-2-like protein 1
Name:Bcl-2-like protein 1
Type:Mitochondrion membrane; Single-pass membrane protein
Mol. Mass.:26039.60
Organism:Homo sapiens (Human)
Description:n/a
Residue:233
BDBM50308110
NameBDBM50308110
Synonyms:(S,Z)-2-(5-((6-(2,3-dimethoxyphenyl)pyridin-3-yl)methylene)-4-oxo-2-thioxothiazolidin-3-yl)-3-phenylpropanoic acid | CHEMBL605114
TypeSmall organic molecule
Emp. Form.C26H22N2O5S2
Mol. Mass.506.593
SMILESCOc1cccc(c1OC)-c1ccc(\C=C2/SC(=S)N([C@@H](Cc3ccccc3)C(O)=O)C2=O)cn1