Reaction Details
TargetSodium-dependent serotonin transporter
LigandBDBM50302922
Substrate/Competitorn/a
Meas. Tech.ChEMBL_610771 (CHEMBL1064406)
IC50>100±n/a nM
Citation Carroll, FIBlough, BEMascarella, SWNavarro, HAEaton, JBLukas, RJDamaj, MI Synthesis and biological evaluation of bupropion analogues as potential pharmacotherapies for smoking cessation. J Med Chem53:2204-14 (2010) 
 
Sodium-dependent serotonin transporter
Name:Sodium-dependent serotonin transporter
Type:Multi-pass membrane protein
Mol. Mass.:70322.51
Organism:Homo sapiens (Human)
Description:P31645
Residue:630
BDBM50302922
NameBDBM50302922
Synonyms:1-(4-bromo-3-methylphenyl)-2-(tert-butylamino)propan-1-one CHEMBL565845
TypeSmall organic molecule
Emp. Form.C14H20BrNO
Mol. Mass.298.219
SMILESCC(NC(C)(C)C)C(=O)c1ccc(Br)c(C)c1