Reaction Details
TargetCannabinoid receptor 1
LigandBDBM50308538
Substrate/Competitorn/a
Meas. Tech.ChEMBL_613495 (CHEMBL1072261)
Ki>10000±n/a nM
Citation Gao, MWang, MMiller, KDHutchins, GDZheng, QH Synthesis and in vitro biological evaluation of carbon-11-labeled quinoline derivatives as new candidate PET radioligands for cannabinoid CB2 receptor imaging. Bioorg Med Chem18:2099-106 (2010) 
 
Cannabinoid receptor 1
Name:Cannabinoid receptor 1
Type:G Protein-Coupled Receptor (GPCR)
Mol. Mass.:52868.96
Organism:Homo sapiens (Human)
Description:P21554
Residue:472
BDBM50308538
NameBDBM50308538
Synonyms:7-Methoxy-2-oxo-8-pentyloxy-1,2-dihydroquinoline-3-carboxylic Acid [2-(4-chlorophenyl)-ethyl]amide CHEMBL203924
TypeSmall organic molecule
Emp. Form.C24H27ClN2O4
Mol. Mass.442.935
SMILESCCCCCOc1c(OC)ccc2cc(C(=O)NCCc3ccc(Cl)cc3)c(=O)[nH]c12