Reaction Details
TargetCannabinoid receptor 2
LigandBDBM50308545
Substrate/Competitorn/a
Meas. Tech.ChEMBL_613496 (CHEMBL1072262)
Ki 1330±n/a nM
Citation Gao, MWang, MMiller, KDHutchins, GDZheng, QH Synthesis and in vitro biological evaluation of carbon-11-labeled quinoline derivatives as new candidate PET radioligands for cannabinoid CB2 receptor imaging. Bioorg Med Chem18:2099-106 (2010) 
 
Cannabinoid receptor 2
Name:Cannabinoid receptor 2
Type:G Protein-Coupled Receptor (GPCR)
Mol. Mass.:39690.94
Organism:Homo sapiens (Human)
Description:P34972
Residue:360
BDBM50308545
NameBDBM50308545
Synonyms:2-Chloro-7-methoxy-8-pentyloxy-1-quinoline-3-carboxylic acid[2-(4-methoxyphenyl)ethyl]amide | CHEMBL590766
TypeSmall organic molecule
Emp. Form.C25H29ClN2O4
Mol. Mass.456.962
SMILESCCCCCOc1c(OC)ccc2cc(C(=O)NCCc3ccc(OC)cc3)c(Cl)nc12