Reaction Details
TargetCannabinoid receptor 2
LigandBDBM50308546
Substrate/Competitorn/a
Meas. Tech.ChEMBL_613496 (CHEMBL1072262)
Ki 23.8±n/a nM
Citation Gao, MWang, MMiller, KDHutchins, GDZheng, QH Synthesis and in vitro biological evaluation of carbon-11-labeled quinoline derivatives as new candidate PET radioligands for cannabinoid CB2 receptor imaging. Bioorg Med Chem18:2099-106 (2010) 
 
Cannabinoid receptor 2
Name:Cannabinoid receptor 2
Type:G Protein-Coupled Receptor (GPCR)
Mol. Mass.:39690.94
Organism:Homo sapiens (Human)
Description:P34972
Residue:360
BDBM50308546
NameBDBM50308546
Synonyms:2-Chloro-7-methoxy-8-pentyloxy-1-quinoline-3-carboxylic acid[2-(4-fluorophenyl)ethyl]amide | CHEMBL600254
TypeSmall organic molecule
Emp. Form.C24H26ClFN2O3
Mol. Mass.444.926
SMILESCCCCCOc1c(OC)ccc2cc(C(=O)NCCc3ccc(F)cc3)c(Cl)nc12