Reaction Details
TargetIntegrin alpha-V/beta-5
LigandBDBM50308730
Substrate/Competitorn/a
Meas. Tech.ChEMBL_607329 (CHEMBL1064845)
IC50 5200±n/a nM
Citation Dal Pozzo, ANi, MHEsposito, EDallavalle, SMusso, LBargiotti, APisano, CVesci, LBucci, FCastorina, MFoderà, RGiannini, GAulicino, CPenco, S Novel tumor-targeted RGD peptide-camptothecin conjugates: synthesis and biological evaluation. Bioorg Med Chem18:64-72 (2010) 
 
Integrin alpha-V/beta-5
Name:Integrin alpha-V/beta-5
Type:Enzyme
Mol. Mass.:n/a
Description:n/a
Components:This complex has 2 components.
Component 1
Name:Integrin alpha-V
Synonyms:ITAV_HUMAN Integrin alpha-V/alpha-5 VNRA Vitronectin receptor | Vitronectin receptor subunit alpha
Type:PROTEIN
Mol. Mass.:116024.92
Organism:Homo sapiens (Human)
Description:ChEMBL_582336
Residue:1048
Component 2
Name:Integrin beta-5
Synonyms:ITB5_HUMAN | ITGB5
Type:PROTEIN
Mol. Mass.:88047.37
Organism:Homo sapiens (Human)
Description:EBI_10915
Residue:799
BDBM50308730
NameBDBM50308730
Synonyms:4-((2S,5S,11S,14R)-14-benzyl-11-(carboxymethyl)-5-(3-guanidinopropyl)-3,6,9,12,15-pentaoxo-1,4,7,10,13-pentaazacyclopentadecan-2-yl)butanoic acid | CHEMBL590547
TypeSmall organic molecule
Emp. Form.C27H38N8O9
Mol. Mass.618.6388
SMILES[#7]\[#6](-[#7])=[#7]\[#6]-[#6]-[#6]-[#6@@H]-1-[#7]-[#6](=O)-[#6@H](-[#6]-[#6]-[#6]-[#6](-[#8])=O)-[#7]-[#6](=O)-[#6@@H](-[#6]-c2ccccc2)-[#7]-[#6](=O)-[#6@H](-[#6]-[#6](-[#8])=O)-[#7]-[#6](=O)-[#6]-[#7]-[#6]-1=O