Reaction Details
TargetSolute carrier family 15 member 1
LigandBDBM50308747
Substrate/Competitorn/a
Meas. Tech.ChEMBL_607731 (CHEMBL1066196)
IC50 390000±n/a nM
Citation Sun, JDahan, AAmidon, GL Enhancing the intestinal absorption of molecules containing the polar guanidino functionality: a double-targeted prodrug approach. J Med Chem53:624-32 (2010) 
 
Solute carrier family 15 member 1
Name:Solute carrier family 15 member 1
Type:PROTEIN
Mol. Mass.:78818.07
Organism:Homo sapiens (Human)
Description:ChEMBL_1488839
Residue:708
BDBM50308747
NameBDBM50308747
Synonyms:(S)-2-amino-3-methylbutanoic benzoic anhydride | CHEMBL592658
TypeSmall organic molecule
Emp. Form.C12H15NO3
Mol. Mass.221.2524
SMILESCC(C)[C@H](N)C(=O)OC(=O)c1ccccc1