Reaction Details
TargetCarbonyl reductase [NADPH] 1
LigandBDBM50308753
Substrate/Competitorn/a
Meas. Tech.ChEMBL_607771 (CHEMBL1068742)
IC50 20000±n/a nM
Citation Berhe, SSlupe, ALuster, CCharlier, HAWarner, DLZalkow, LHBurgess, EMEnwerem, NMBakare, O Synthesis of 3-[(N-carboalkoxy)ethylamino]-indazole-dione derivatives and their biological activities on human liver carbonyl reductase. Bioorg Med Chem18:134-41 (2010) 
 
Carbonyl reductase [NADPH] 1
Name:Carbonyl reductase [NADPH] 1
Type:PROTEIN
Mol. Mass.:30380.63
Organism:Homo sapiens (Human)
Description:ChEMBL_607770
Residue:277
BDBM50308753
NameBDBM50308753
Synonyms:3-(Methyl-N-ethylcarbamate)-5-hydroxybenz[f]indazol-4,9-dione | CHEMBL601512
TypeSmall organic molecule
Emp. Form.C15H13N3O5
Mol. Mass.315.2808
SMILESCOC(=O)NCCc1n[nH]c2c1C(=O)c1c(O)cccc1C2=O