Reaction Details
TargetMitogen-activated protein kinase 14
LigandBDBM50308756
Substrate/Competitorn/a
Meas. Tech.ChEMBL_607570 (CHEMBL1073514)
IC50 1648±n/a nM
Citation Dietrich, JGokhale, VWang, XHurley, LHFlynn, GA Application of a novel [3+2] cycloaddition reaction to prepare substituted imidazoles and their use in the design of potent DFG-out allosteric B-Raf inhibitors. Bioorg Med Chem18:292-304 (2010) 
 
Mitogen-activated protein kinase 14
Name:Mitogen-activated protein kinase 14
Type:Serine/threonine-protein kinase
Mol. Mass.:41286.76
Organism:Homo sapiens (Human)
Description:Q16539
Residue:360
BDBM50308756
NameBDBM50308756
Synonyms:CHEMBL605198 | N-(4-Methyl-3-(3-methyl-4-oxo-3,4-dihydroquinazolin-6-ylamino)phenyl)-5-p-tolyl-2-(trifluoromethyl)-1H-imidazole-4-carboxamide
TypeSmall organic molecule
Emp. Form.C28H23F3N6O2
Mol. Mass.532.5164
SMILESCc1ccc(cc1)-c1nc([nH]c1C(=O)Nc1ccc(C)c(Nc2ccc3ncn(C)c(=O)c3c2)c1)C(F)(F)F