Reaction Details
TargetTyrosine-protein phosphatase non-receptor type 1
LigandBDBM50219566
Substrate/Competitorn/a
Meas. Tech.ChEMBL_607676 (CHEMBL1071696)
Ki 4±n/a nM
Citation Combs, AP Recent advances in the discovery of competitive protein tyrosine phosphatase 1B inhibitors for the treatment of diabetes, obesity, and cancer. J Med Chem53:2333-44 (2010) 
 
Tyrosine-protein phosphatase non-receptor type 1
Name:Tyrosine-protein phosphatase non-receptor type 1
Type:Protein phosphatase
Mol. Mass.:49963.76
Organism:Homo sapiens (Human)
Description:Human recombinant GST-fusion PTP1B (1-435).
Residue:435
BDBM50219566
NameBDBM50219566
Synonyms:4-bromo-3-carboxymethoxy-5-[3-(1-phenylmethanesulfonylpiperidin-4-ylamino)phenyl]thiophene-2-carboxylic acid 5-(3-{[1-(BENZYLSULFONYL)PIPERIDIN-4-YL]AMINO}PHENYL)-4-BROMO-3-(CARBOXYMETHOXY)THIOPHENE-2-CARBOXYLIC ACID | CHEMBL541214
TypeSmall organic molecule
Emp. Form.C25H25BrN2O7S2
Mol. Mass.609.509
SMILESOC(=O)COc1c(Br)c(sc1C(O)=O)-c1cccc(NC2CCN(CC2)S(=O)(=O)Cc2ccccc2)c1