Reaction Details
TargetTyrosine-protein phosphatase non-receptor type 1
LigandBDBM50308852
Substrate/Competitorn/a
Meas. Tech.ChEMBL_607676 (CHEMBL1071696)
Ki 18±n/a nM
Citation Combs, AP Recent advances in the discovery of competitive protein tyrosine phosphatase 1B inhibitors for the treatment of diabetes, obesity, and cancer. J Med Chem53:2333-44 (2010) 
 
Tyrosine-protein phosphatase non-receptor type 1
Name:Tyrosine-protein phosphatase non-receptor type 1
Type:Protein phosphatase
Mol. Mass.:49963.76
Organism:Homo sapiens (Human)
Description:Human recombinant GST-fusion PTP1B (1-435).
Residue:435
BDBM50308852
NameBDBM50308852
Synonyms:(S)-2-(N-(4-(2-acetamido-3-(4-(3-hydroxy-2-(methoxycarbonyl)phenoxy)butylamino)-3-oxopropyl)-2-ethylphenyl)-1-carboxyformamido)benzoic acid | CHEMBL590122
TypeSmall organic molecule
Emp. Form.C34H37N3O11
Mol. Mass.663.6711
SMILESCCc1cc(C[C@H](NC(C)=O)C(=O)NCCCCOc2cccc(O)c2C(=O)OC)ccc1N(C(=O)C(O)=O)c1ccccc1C(O)=O