Reaction Details
TargetRho-associated protein kinase 2
LigandBDBM50309111
Substrate/Competitorn/a
Meas. Tech.ChEMBL_608134 (CHEMBL1074823)
IC50 52000±n/a nM
Citation Henderson, AJHadden, MGuo, CDouglas, NDecornez, HHellberg, MRRusinko, AMcLaughlin, MSharif, NDrace, CPatil, R 2,3-Diaminopyrazines as rho kinase inhibitors. Bioorg Med Chem Lett20:1137-40 (2010) 
 
Rho-associated protein kinase 2
Name:Rho-associated protein kinase 2
Type:Protein
Mol. Mass.:160885.43
Organism:Homo sapiens (Human)
Description:O75116
Residue:1388
BDBM50309111
NameBDBM50309111
Synonyms:CHEMBL590238 | N-(2-methoxyethyl)-3-(4-methyl-1,4-diazepan-1-yl)-5-(pyridin-4-yl)pyrazin-2-amine
TypeSmall organic molecule
Emp. Form.C18H26N6O
Mol. Mass.342.4386
SMILESCOCCNc1ncc(nc1N1CCCN(C)CC1)-c1ccncc1