Reaction Details
TargetRho-associated protein kinase 2
LigandBDBM50309120
Substrate/Competitorn/a
Meas. Tech.ChEMBL_608134 (CHEMBL1074823)
IC50 28±n/a nM
Citation Henderson, AJHadden, MGuo, CDouglas, NDecornez, HHellberg, MRRusinko, AMcLaughlin, MSharif, NDrace, CPatil, R 2,3-Diaminopyrazines as rho kinase inhibitors. Bioorg Med Chem Lett20:1137-40 (2010) 
 
Rho-associated protein kinase 2
Name:Rho-associated protein kinase 2
Type:Protein
Mol. Mass.:160885.43
Organism:Homo sapiens (Human)
Description:O75116
Residue:1388
BDBM50309120
NameBDBM50309120
Synonyms:(1-(6-(pyridin-4-yl)-3-(pyrrolidin-1-yl)pyrazin-2-yl)piperidin-4-yl)methanamine | CHEMBL591285
TypeSmall organic molecule
Emp. Form.C19H26N6
Mol. Mass.338.4499
SMILESNCC1CCN(CC1)c1nc(cnc1N1CCCC1)-c1ccncc1