Reaction Details
TargetRho-associated protein kinase 1
LigandBDBM50309119
Substrate/Competitorn/a
Meas. Tech.ChEMBL_608133 (CHEMBL1074822)
IC50 1800±n/a nM
Citation Henderson, AJHadden, MGuo, CDouglas, NDecornez, HHellberg, MRRusinko, AMcLaughlin, MSharif, NDrace, CPatil, R 2,3-Diaminopyrazines as rho kinase inhibitors. Bioorg Med Chem Lett20:1137-40 (2010) 
 
Rho-associated protein kinase 1
Name:Rho-associated protein kinase 1
Type:Serine/threonine-protein kinase
Mol. Mass.:158156.77
Organism:Homo sapiens (Human)
Description:Q13464
Residue:1354
BDBM50309119
NameBDBM50309119
Synonyms:CHEMBL591047 | N-methyl-1-(6-(pyridin-4-yl)-3-(pyrrolidin-1-yl)pyrazin-2-yl)piperidin-4-amine
TypeSmall organic molecule
Emp. Form.C19H26N6
Mol. Mass.338.4499
SMILESCNC1CCN(CC1)c1nc(cnc1N1CCCC1)-c1ccncc1