Reaction Details
TargetRho-associated protein kinase 1
LigandBDBM50309122
Substrate/Competitorn/a
Meas. Tech.ChEMBL_608133 (CHEMBL1074822)
IC50 170±n/a nM
Citation Henderson, AJHadden, MGuo, CDouglas, NDecornez, HHellberg, MRRusinko, AMcLaughlin, MSharif, NDrace, CPatil, R 2,3-Diaminopyrazines as rho kinase inhibitors. Bioorg Med Chem Lett20:1137-40 (2010) 
 
Rho-associated protein kinase 1
Name:Rho-associated protein kinase 1
Type:Serine/threonine-protein kinase
Mol. Mass.:158156.77
Organism:Homo sapiens (Human)
Description:Q13464
Residue:1354
BDBM50309122
NameBDBM50309122
Synonyms:4-(6-(1,4-diazepan-1-yl)-5-(pyrrolidin-1-yl)pyrazin-2-yl)-1H-pyrrolo[2,3-b]pyridine | CHEMBL598963
TypeSmall organic molecule
Emp. Form.C20H25N7
Mol. Mass.363.4594
SMILESC1CCN(C1)c1ncc(nc1N1CCCNCC1)-c1ccnc2[nH]ccc12