Reaction Details
TargetN-acylethanolamine-hydrolyzing acid amidase
LigandBDBM50309176
Substrate/Competitorn/a
Meas. Tech.ChEMBL_608785 (CHEMBL1068377)
IC50 8300±n/a nM
Citation Saturnino, CPetrosino, SLigresti, APalladino, CDe Martino, GBisogno, TDi Marzo, V Synthesis and biological evaluation of new potential inhibitors of N-acylethanolamine hydrolyzing acid amidase. Bioorg Med Chem Lett20:1210-3 (2010) 
 
N-acylethanolamine-hydrolyzing acid amidase
Name:N-acylethanolamine-hydrolyzing acid amidase
Type:Enzyme
Mol. Mass.:40073.12
Organism:Homo sapiens (Human)
Description:Q02083
Residue:359
BDBM50309176
NameBDBM50309176
Synonyms:CHEMBL190429 N-pentadecylbenzamide
TypeSmall organic molecule
Emp. Form.C22H37NO
Mol. Mass.331.5353
(=O)c1ccccc1