Reaction Details
TargetN-acylethanolamine-hydrolyzing acid amidase
LigandBDBM50309177
Substrate/Competitorn/a
Meas. Tech.ChEMBL_608772 (CHEMBL1068364)
IC50 10000±n/a nM
Citation Saturnino, CPetrosino, SLigresti, APalladino, CDe Martino, GBisogno, TDi Marzo, V Synthesis and biological evaluation of new potential inhibitors of N-acylethanolamine hydrolyzing acid amidase. Bioorg Med Chem Lett20:1210-3 (2010) 
 
N-acylethanolamine-hydrolyzing acid amidase
Name:N-acylethanolamine-hydrolyzing acid amidase
Type:Enzyme
Mol. Mass.:40073.12
Organism:Homo sapiens (Human)
Description:Q02083
Residue:359
BDBM50309177
NameBDBM50309177
Synonyms:CHEMBL590884 | cyclopentyl palmitate
TypeSmall organic molecule
Emp. Form.C21H40O2
Mol. Mass.324.5411
(=O)OC1CCCC1