Reaction Details
TargetInsulin-like growth factor 1 receptor
LigandBDBM50309547
Substrate/Competitorn/a
Meas. Tech.ChEMBL_609781 (CHEMBL1070748)
IC50 3198±n/a nM
Citation Ilovich, OBillauer, HDotan, SMishani, E Labeled 3-aryl-4-indolylmaleimide derivatives and their potential as angiogenic PET biomarkers. Bioorg Med Chem18:612-20 (2010) 
 
Insulin-like growth factor 1 receptor
Name:Insulin-like growth factor 1 receptor
Type:Protein
Mol. Mass.:154776.79
Organism:Homo sapiens (Human)
Description:P08069
Residue:1367
BDBM50309547
NameBDBM50309547
Synonyms:3-(5-Iodo-1H-indol-3-yl)-4-(3,4,5-trimethoxyphenyl)-1H-pyrrole-2,5-dione | CHEMBL597492
TypeSmall organic molecule
Emp. Form.C21H17IN2O5
Mol. Mass.504.2746
SMILESCOc1cc(cc(OC)c1OC)C1=C(C(=O)NC1=O)c1c[nH]c2ccc(I)cc12