Reaction Details
TargetReceptor tyrosine-protein kinase erbB-2
LigandBDBM50309548
Substrate/Competitorn/a
Meas. Tech.ChEMBL_609780 (CHEMBL1070747)
IC50 13316±n/a nM
Citation Ilovich, OBillauer, HDotan, SMishani, E Labeled 3-aryl-4-indolylmaleimide derivatives and their potential as angiogenic PET biomarkers. Bioorg Med Chem18:612-20 (2010) 
 
Receptor tyrosine-protein kinase erbB-2
Name:Receptor tyrosine-protein kinase erbB-2
Type:n/a
Mol. Mass.:137894.47
Organism:Homo sapiens (Human)
Description:P04626
Residue:1255
BDBM50309548
NameBDBM50309548
Synonyms:3-(5-Bromo-1H-indol-3-yl)-4-(3,4,5-trimethoxyphenyl)-1H-pyrrole-2,5-dione | CHEMBL605957
TypeSmall organic molecule
Emp. Form.C21H17BrN2O5
Mol. Mass.457.274
SMILESCOc1cc(cc(OC)c1OC)C1=C(C(=O)NC1=O)c1c[nH]c2ccc(Br)cc12