Reaction Details
TargetFatty-acid amide hydrolase 1
LigandBDBM50309714
Substrate/Competitorn/a
Meas. Tech.ChEMBL_610820 (CHEMBL1068137)
IC50 0.4±n/a nM
Citation Sit, SYConway, CMXie, KBertekap, RBourin, CBurris, KD Oxime carbamate--discovery of a series of novel FAAH inhibitors. Bioorg Med Chem Lett20:1272-7 (2010) 
 
Fatty-acid amide hydrolase 1
Name:Fatty-acid amide hydrolase 1
Type:Protein
Mol. Mass.:63071.19
Organism:Homo sapiens (Human)
Description:O00519
Residue:579
BDBM50309714
NameBDBM50309714
Synonyms:4-fluorobenzaldehyde O-4-(undecyloxy)phenylcarbamoyl oxime | CHEMBL596659
TypeSmall organic molecule
Emp. Form.C25H33FN2O3
Mol. Mass.428.5395
SMILESCCCCCCCCCCCOc1ccc(NC(=O)O\N=C\c2ccc(F)cc2)cc1