Reaction Details
TargetFatty-acid amide hydrolase 1
LigandBDBM50309724
Substrate/Competitorn/a
Meas. Tech.ChEMBL_610820 (CHEMBL1068137)
IC50 0.35±n/a nM
Citation Sit, SYConway, CMXie, KBertekap, RBourin, CBurris, KD Oxime carbamate--discovery of a series of novel FAAH inhibitors. Bioorg Med Chem Lett20:1272-7 (2010) 
 
Fatty-acid amide hydrolase 1
Name:Fatty-acid amide hydrolase 1
Type:Protein
Mol. Mass.:63071.19
Organism:Homo sapiens (Human)
Description:O00519
Residue:579
BDBM50309724
NameBDBM50309724
Synonyms:CHEMBL598558 | nicotinaldehyde O-4-(decyloxy)phenylcarbamoyl oxime
TypeSmall organic molecule
Emp. Form.C23H31N3O3
Mol. Mass.397.5105
SMILESCCCCCCCCCCOc1ccc(NC(=O)O\N=C\c2cccnc2)cc1