Reaction Details
TargetFatty-acid amide hydrolase 1
LigandBDBM50309735
Substrate/Competitorn/a
Meas. Tech.ChEMBL_610820 (CHEMBL1068137)
IC50 1.4±n/a nM
Citation Sit, SYConway, CMXie, KBertekap, RBourin, CBurris, KD Oxime carbamate--discovery of a series of novel FAAH inhibitors. Bioorg Med Chem Lett20:1272-7 (2010) 
 
Fatty-acid amide hydrolase 1
Name:Fatty-acid amide hydrolase 1
Type:Protein
Mol. Mass.:63071.19
Organism:Homo sapiens (Human)
Description:O00519
Residue:579
BDBM50309735
NameBDBM50309735
Synonyms:CHEMBL592771 | phenyl 4-(decyloxy)phenylcarbamate
TypeSmall organic molecule
Emp. Form.C23H31NO3
Mol. Mass.369.4971
SMILESCCCCCCCCCCOc1ccc(NC(=O)Oc2ccccc2)cc1