Reaction Details
TargetFatty-acid amide hydrolase 1
LigandBDBM50309737
Substrate/Competitorn/a
Meas. Tech.ChEMBL_610820 (CHEMBL1068137)
IC50 1.8±n/a nM
Citation Sit, SYConway, CMXie, KBertekap, RBourin, CBurris, KD Oxime carbamate--discovery of a series of novel FAAH inhibitors. Bioorg Med Chem Lett20:1272-7 (2010) 
 
Fatty-acid amide hydrolase 1
Name:Fatty-acid amide hydrolase 1
Type:Protein
Mol. Mass.:63071.19
Organism:Homo sapiens (Human)
Description:O00519
Residue:579
BDBM50309737
NameBDBM50309737
Synonyms:CHEMBL592772 | phenyl 4-(dodecyloxy)phenylcarbamate
TypeSmall organic molecule
Emp. Form.C25H35NO3
Mol. Mass.397.5503
SMILESCCCCCCCCCCCCOc1ccc(NC(=O)Oc2ccccc2)cc1