Reaction Details
TargetNeuropeptide Y receptor type 1
LigandBDBM50309857
Substrate/Competitorn/a
Meas. Tech.ChEMBL_611536 (CHEMBL1066380)
Ki 63±n/a nM
Citation Guérin, BDumulon-Perreault, VTremblay, MCAit-Mohand, SFournier, PDubuc, CAuthier, SBénard, F [Lys(DOTA)4]BVD15, a novel and potent neuropeptide Y analog designed for Y1 receptor-targeted breast tumor imaging. Bioorg Med Chem Lett20:950-3 (2010) 
 
Neuropeptide Y receptor type 1
Name:Neuropeptide Y receptor type 1
Type:Enzyme Catalytic Domain
Mol. Mass.:44399.07
Organism:Homo sapiens (Human)
Description:NPY-Y1 NPY1R HUMAN::P25929
Residue:384
BDBM50309857
NameBDBM50309857
Synonyms:2,2',2''-(10-((6S,9S,12S,15S,18S)-1-amino-18-((S)-1-((S)-4-amino-2-((2S,3S)-2-amino-3-methylpentanamido)-4-oxobutanoyl)pyrrolidine-2-carboxamido)-6-((S)-1-carboxy-2-(4-hydroxyphenyl)ethylcarbamoyl)-12-(3-guanidinopropyl)-15-(4-hydroxybenzyl)-1-imino-9-isobutyl-8,11,14,17,24-pentaoxo-2,7,10,13,16,23-hexaazapentacosan-25-yl)-1,4,7,10-tetraazacyclododecane-1,4,7-triyl)triacetic acid | CHEMBL592100
TypeSmall organic molecule
Emp. Form.C73H117N21O20
Mol. Mass.1608.8388
SMILES[#6]-[#6]-[#6@H](-[#6])-[#6@H](-[#7])-[#6](=O)-[#7]-[#6@@H](-[#6]-[#6](-[#7])=O)-[#6](=O)-[#7]-1-[#6]-[#6]-[#6]-[#6@H]-1-[#6](=O)-[#7]-[#6@@H](-[#6]-[#6]-[#6]-[#6]-[#7]-[#6](=O)-[#6]-[#7]-1-[#6]-[#6]-[#7](-[#6]-[#6](-[#8])=O)-[#6]-[#6]-[#7](-[#6]-[#6](-[#8])=O)-[#6]-[#6]-[#7](-[#6]-[#6](-[#8])=O)-[#6]-[#6]-1)-[#6](=O)-[#7]-[#6@@H](-[#6]-c1ccc(-[#8])cc1)-[#6](=O)-[#7]-[#6@@H](-[#6]-[#6]-[#6]\[#7]=[#6](/[#7])-[#7])-[#6](=O)-[#7]-[#6@@H](-[#6]-[#6](-[#6])-[#6])-[#6](=O)-[#7]-[#6@@H](-[#6]-[#6]-[#6]\[#7]=[#6](/[#7])-[#7])-[#6](=O)-[#7]-[#6@@H](-[#6]-c1ccc(-[#8])cc1)-[#6](-[#8])=O