Reaction Details
TargetNeuropeptide Y receptor type 4
LigandBDBM50309855
Substrate/Competitorn/a
Meas. Tech.ChEMBL_611538 (CHEMBL1066382)
Ki 5.8±n/a nM
Citation Guérin, BDumulon-Perreault, VTremblay, MCAit-Mohand, SFournier, PDubuc, CAuthier, SBénard, F [Lys(DOTA)4]BVD15, a novel and potent neuropeptide Y analog designed for Y1 receptor-targeted breast tumor imaging. Bioorg Med Chem Lett20:950-3 (2010) 
 
Neuropeptide Y receptor type 4
Name:Neuropeptide Y receptor type 4
Type:Enzyme Catalytic Domain
Mol. Mass.:42207.58
Organism:Homo sapiens (Human)
Description:NPY-Y4 PPYR1 HUMAN::P50391
Residue:375
BDBM50309855
NameBDBM50309855
Synonyms:(3S,6S,9S,12S,15S,18S)-1-((S)-1-((S)-4-amino-2-((2S,3S)-2-amino-3-methylpentanamido)-4-oxobutanoyl)pyrrolidin-2-yl)-3-sec-butyl-9,15-bis(3-guanidinopropyl)-6,18-bis(4-hydroxybenzyl)-12-isobutyl-1,4,7,10,13,16-hexaoxo-2,5,8,11,14,17-hexaazanonadecan-19-oic acid | CHEMBL591971
TypeSmall organic molecule
Emp. Form.C57H90N16O13
Mol. Mass.1207.4239
SMILES[#6]-[#6]-[#6@H](-[#6])-[#6@H](-[#7])-[#6](=O)-[#7]-[#6@@H](-[#6]-[#6](-[#7])=O)-[#6](=O)-[#7]-1-[#6]-[#6]-[#6]-[#6@H]-1-[#6](=O)-[#7]-[#6@@H](-[#6@@H](-[#6])-[#6]-[#6])-[#6](=O)-[#7]-[#6@@H](-[#6]-c1ccc(-[#8])cc1)-[#6](=O)-[#7]-[#6@@H](-[#6]-[#6]-[#6]\[#7]=[#6](/[#7])-[#7])-[#6](=O)-[#7]-[#6@@H](-[#6]-[#6](-[#6])-[#6])-[#6](=O)-[#7]-[#6@@H](-[#6]-[#6]-[#6]\[#7]=[#6](/[#7])-[#7])-[#6](=O)-[#7]-[#6@@H](-[#6]-c1ccc(-[#8])cc1)-[#6](-[#8])=O