Reaction Details
TargetSodium- and chloride-dependent glycine transporter 1
LigandBDBM50309964
Substrate/Competitorn/a
Meas. Tech.ChEMBL_612178 (CHEMBL1073598)
Ki 27±n/a nM
Citation Lowe, JADeninno, SLDrozda, SESchmidt, CJWard, KMDavid Tingley, FSanner, MTunucci, DValentine, J An octahydro-cyclopenta[c]pyrrole series of inhibitors of the type 1 glycine transporter. Bioorg Med Chem Lett20:907-11 (2010) 
 
Sodium- and chloride-dependent glycine transporter 1
Name:Sodium- and chloride-dependent glycine transporter 1
Type:Enzyme
Mol. Mass.:78270.54
Organism:Homo sapiens (Human)
Description:P48067
Residue:706
BDBM50309964
NameBDBM50309964
Synonyms:(endo)-N-(4-fluoro-3-(trifluoromethyl)benzyl)-1-methyl-N-(octahydrocyclopenta[c]pyrrol-5-yl)-1H-imidazole-4-carboxamide | CHEMBL607982
TypeSmall organic molecule
Emp. Form.C20H22F4N4O
Mol. Mass.410.4085
SMILESCn1cnc(c1)C(=O)N(Cc1ccc(F)c(c1)C(F)(F)F)[C@H]1C[C@@H]2CNC[C@@H]2C1