Reaction Details
TargetSodium- and chloride-dependent glycine transporter 1
LigandBDBM50309970
Substrate/Competitorn/a
Meas. Tech.ChEMBL_612178 (CHEMBL1073598)
Ki 3.8±n/a nM
Citation Lowe, JADeninno, SLDrozda, SESchmidt, CJWard, KMDavid Tingley, FSanner, MTunucci, DValentine, J An octahydro-cyclopenta[c]pyrrole series of inhibitors of the type 1 glycine transporter. Bioorg Med Chem Lett20:907-11 (2010) 
 
Sodium- and chloride-dependent glycine transporter 1
Name:Sodium- and chloride-dependent glycine transporter 1
Type:Enzyme
Mol. Mass.:78270.54
Organism:Homo sapiens (Human)
Description:P48067
Residue:706
BDBM50309970
NameBDBM50309970
Synonyms:(exo)-1-Methyl-1H-imidazole-4-carboxylic acid(3-cyclopentyloxy-4-fluorobenzyl)-(2-methyl-octahydro-cyclopenta[c]pyrrol-5-yl)-amide | CHEMBL599482
TypeSmall organic molecule
Emp. Form.C25H33FN4O2
Mol. Mass.440.5535
SMILESCN1C[C@@H]2C[C@@H](C[C@@H]2C1)N(Cc1ccc(F)c(OC2CCCC2)c1)C(=O)c1cn(C)cn1