Reaction Details
TargetSodium- and chloride-dependent glycine transporter 1
LigandBDBM50309966
Substrate/Competitorn/a
Meas. Tech.ChEMBL_612178 (CHEMBL1073598)
Ki 2.8±n/a nM
Citation Lowe, JADeninno, SLDrozda, SESchmidt, CJWard, KMDavid Tingley, FSanner, MTunucci, DValentine, J An octahydro-cyclopenta[c]pyrrole series of inhibitors of the type 1 glycine transporter. Bioorg Med Chem Lett20:907-11 (2010) 
 
Sodium- and chloride-dependent glycine transporter 1
Name:Sodium- and chloride-dependent glycine transporter 1
Type:Enzyme
Mol. Mass.:78270.54
Organism:Homo sapiens (Human)
Description:P48067
Residue:706
BDBM50309966
NameBDBM50309966
Synonyms:(exo)-N-(2-(2-hydroxy-2-phenylethyl)octahydrocyclopenta[c]pyrrol-5-yl)-1-methyl-N-(3-(trifluoromethoxy)benzyl)-1H-imidazole-4-carboxamide | CHEMBL597033
TypeSmall organic molecule
Emp. Form.C28H31F3N4O3
Mol. Mass.528.5659
SMILESCn1cnc(c1)C(=O)N(Cc1cccc(OC(F)(F)F)c1)[C@H]1C[C@H]2CN(CC(O)c3ccccc3)C[C@H]2C1