Reaction Details
TargetPotassium voltage-gated channel subfamily H member 2
LigandBDBM50309954
Substrate/Competitorn/a
Meas. Tech.ChEMBL_612185 (CHEMBL1074123)
Ki 2560±n/a nM
Citation Lowe, JADeninno, SLDrozda, SESchmidt, CJWard, KMDavid Tingley, FSanner, MTunucci, DValentine, J An octahydro-cyclopenta[c]pyrrole series of inhibitors of the type 1 glycine transporter. Bioorg Med Chem Lett20:907-11 (2010) 
 
Potassium voltage-gated channel subfamily H member 2
Name:Potassium voltage-gated channel subfamily H member 2
Type:Multi-pass membrane protein
Mol. Mass.:126672.65
Organism:Homo sapiens (Human)
Description:Q12809
Residue:1159
BDBM50309954
NameBDBM50309954
Synonyms:(exo)-1-methyl-N-(2-methyloctahydrocyclopenta[c]pyrrol-5-yl)-N-(3-(trifluoromethoxy)benzyl)-1H-imidazole-4-carboxamide | CHEMBL598659
TypeSmall organic molecule
Emp. Form.C21H25F3N4O2
Mol. Mass.422.444
SMILESCN1C[C@@H]2C[C@@H](C[C@@H]2C1)N(Cc1cccc(OC(F)(F)F)c1)C(=O)c1cn(C)cn1