Reaction Details
TargetPotassium voltage-gated channel subfamily H member 2
LigandBDBM50309958
Substrate/Competitorn/a
Meas. Tech.ChEMBL_612185 (CHEMBL1074123)
Ki>4760±n/a nM
Citation Lowe, JADeninno, SLDrozda, SESchmidt, CJWard, KMDavid Tingley, FSanner, MTunucci, DValentine, J An octahydro-cyclopenta[c]pyrrole series of inhibitors of the type 1 glycine transporter. Bioorg Med Chem Lett20:907-11 (2010) 
 
Potassium voltage-gated channel subfamily H member 2
Name:Potassium voltage-gated channel subfamily H member 2
Type:Multi-pass membrane protein
Mol. Mass.:126672.65
Organism:Homo sapiens (Human)
Description:Q12809
Residue:1159
BDBM50309958
NameBDBM50309958
Synonyms:(exo)-1-Methyl-1H-imidazole-4-carboxylic acid(3-cyclopentyloxy, 4-fluorobenzyl)-octahydro-cyclopenta[c]pyrrol-5-yl)-amide | CHEMBL599060
TypeSmall organic molecule
Emp. Form.C24H31FN4O2
Mol. Mass.426.5269
SMILESCn1cnc(c1)C(=O)N(Cc1ccc(F)c(OC2CCCC2)c1)[C@@H]1C[C@@H]2CNC[C@@H]2C1