Reaction Details
TargetCytochrome P450 3A4
LigandBDBM50309966
Substrate/Competitorn/a
Meas. Tech.ChEMBL_612188 (CHEMBL1074126)
IC50>10000±n/a nM
Citation Lowe, JADeninno, SLDrozda, SESchmidt, CJWard, KMDavid Tingley, FSanner, MTunucci, DValentine, J An octahydro-cyclopenta[c]pyrrole series of inhibitors of the type 1 glycine transporter. Bioorg Med Chem Lett20:907-11 (2010) 
 
Cytochrome P450 3A4
Name:Cytochrome P450 3A4
Type:Enzyme
Mol. Mass.:57349.57
Organism:Homo sapiens (Human)
Description:n/a
Residue:503
BDBM50309966
NameBDBM50309966
Synonyms:(exo)-N-(2-(2-hydroxy-2-phenylethyl)octahydrocyclopenta[c]pyrrol-5-yl)-1-methyl-N-(3-(trifluoromethoxy)benzyl)-1H-imidazole-4-carboxamide | CHEMBL597033
TypeSmall organic molecule
Emp. Form.C28H31F3N4O3
Mol. Mass.528.5659
SMILESCn1cnc(c1)C(=O)N(Cc1cccc(OC(F)(F)F)c1)[C@H]1C[C@H]2CN(CC(O)c3ccccc3)C[C@H]2C1