Reaction Details
TargetCannabinoid receptor 1
LigandBDBM50310022
Substrate/Competitorn/a
Meas. Tech.ChEMBL_612189 (CHEMBL1074127)
IC50 1050±n/a nM
Citation Seo, HJKim, MJLee, SHLee, SHJung, MEKim, MSAhn, KKim, JLee, J Synthesis and structure-activity relationship of 1,2,4-triazole-containing diarylpyrazolyl carboxamide as CB1 cannabinoid receptor-ligand. Bioorg Med Chem18:1149-62 (2010) 
 
Cannabinoid receptor 1
Name:Cannabinoid receptor 1
Type:G Protein-Coupled Receptor (GPCR)
Mol. Mass.:52856.55
Organism:Rattus norvegicus (rat)
Description:P20272
Residue:473
BDBM50310022
NameBDBM50310022
Synonyms:(4-((1H-1,2,4-Triazol-1-yl)methyl)-1-(2-chlorophenyl)-5-(4-chlorophenyl)-1H-pyrazol-3-yl)(4-ethylpiperazin-1-yl)methanone | CHEMBL598464
TypeSmall organic molecule
Emp. Form.C25H25Cl2N7O
Mol. Mass.510.418
SMILESCCN1CCN(CC1)C(=O)c1nn(c(c1Cn1cncn1)-c1ccc(Cl)cc1)-c1ccccc1Cl