Reaction Details
TargetCannabinoid receptor 1
LigandBDBM50310049
Substrate/Competitorn/a
Meas. Tech.ChEMBL_612189 (CHEMBL1074127)
IC50 3.31±n/a nM
Citation Seo, HJKim, MJLee, SHLee, SHJung, MEKim, MSAhn, KKim, JLee, J Synthesis and structure-activity relationship of 1,2,4-triazole-containing diarylpyrazolyl carboxamide as CB1 cannabinoid receptor-ligand. Bioorg Med Chem18:1149-62 (2010) 
 
Cannabinoid receptor 1
Name:Cannabinoid receptor 1
Type:G Protein-Coupled Receptor (GPCR)
Mol. Mass.:52856.55
Organism:Rattus norvegicus (rat)
Description:P20272
Residue:473
BDBM50310049
NameBDBM50310049
Synonyms:4-((1H-1,2,4-Triazol-1-yl)methyl)-5-(4-bromophenyl)-1-(2,4-dichlorophenyl)-N-(1-(trifluoromethyl)cyclopropyl)-1Hpyrazole-3-carboxamide | CHEMBL599372
TypeSmall organic molecule
Emp. Form.C23H16BrCl2F3N6O
Mol. Mass.600.218
SMILESFC(F)(F)C1(CC1)NC(=O)c1nn(c(c1Cn1cncn1)-c1ccc(Br)cc1)-c1ccc(Cl)cc1Cl