Reaction Details
TargetCannabinoid receptor 1
LigandBDBM50310054
Substrate/Competitorn/a
Meas. Tech.ChEMBL_612189 (CHEMBL1074127)
IC50 5.11±n/a nM
Citation Seo, HJKim, MJLee, SHLee, SHJung, MEKim, MSAhn, KKim, JLee, J Synthesis and structure-activity relationship of 1,2,4-triazole-containing diarylpyrazolyl carboxamide as CB1 cannabinoid receptor-ligand. Bioorg Med Chem18:1149-62 (2010) 
 
Cannabinoid receptor 1
Name:Cannabinoid receptor 1
Type:G Protein-Coupled Receptor (GPCR)
Mol. Mass.:52856.55
Organism:Rattus norvegicus (rat)
Description:P20272
Residue:473
BDBM50310054
NameBDBM50310054
Synonyms:4-((1H-1,2,4-Triazol-1-yl)methyl)-5-(4-bromophenyl)-1-(2,4-dichlorophenyl)-N-(piperidin-1-yl)-1H-pyrazole-3-carboxamide | CHEMBL598550
TypeSmall organic molecule
Emp. Form.C24H21BrCl2N6O
Mol. Mass.560.273
SMILESClc1ccc(c(Cl)c1)-n1nc(C(=O)N2CCCCC2)c(Cn2cncn2)c1-c1ccc(Br)cc1