Reaction Details
TargetCannabinoid receptor 1
LigandBDBM50310058
Substrate/Competitorn/a
Meas. Tech.ChEMBL_612189 (CHEMBL1074127)
IC50 4.75±n/a nM
Citation Seo, HJKim, MJLee, SHLee, SHJung, MEKim, MSAhn, KKim, JLee, J Synthesis and structure-activity relationship of 1,2,4-triazole-containing diarylpyrazolyl carboxamide as CB1 cannabinoid receptor-ligand. Bioorg Med Chem18:1149-62 (2010) 
 
Cannabinoid receptor 1
Name:Cannabinoid receptor 1
Type:G Protein-Coupled Receptor (GPCR)
Mol. Mass.:52856.55
Organism:Rattus norvegicus (rat)
Description:P20272
Residue:473
BDBM50310058
NameBDBM50310058
Synonyms:4-((1H-1,2,4-Triazol-1-yl)methyl)-1-(2-chlorophenyl)-5-(4-chlorophenyl)-N-(1-(trifluoromethyl)cyclopropyl)-1H-pyrazole-3-carboxamide | CHEMBL599571
TypeSmall organic molecule
Emp. Form.C23H17Cl2F3N6O
Mol. Mass.521.322
SMILESFC(F)(F)C1(CC1)NC(=O)c1nn(c(c1Cn1cncn1)-c1ccc(Cl)cc1)-c1ccccc1Cl