Reaction Details
TargetAmine oxidase [flavin-containing] A
LigandBDBM7459
Substrate/Competitorn/a
Meas. Tech.ChEMBL_612779 (CHEMBL1071605)
IC50 4900±n/a nM
Citation Chimenti, FFioravanti, RBolasco, AChimenti, PSecci, DRossi, FYáñez, MOrallo, FOrtuso, FAlcaro, SCirilli, RFerretti, RSanna, ML A new series of flavones, thioflavones, and flavanones as selective monoamine oxidase-B inhibitors. Bioorg Med Chem18:1273-9 (2010) 
 
Amine oxidase [flavin-containing] A
Name:Amine oxidase [flavin-containing] A
Type:Protein
Mol. Mass.:59689.53
Organism:Homo sapiens (Human)
Description:P21397
Residue:527
BDBM7459
NameBDBM7459
Synonyms:2-(3,4-dihydroxyphenyl)-5,7-dihydroxy-4H-chromen-4-one CHEMBL151 Luteolin (4) cid_5280445 med.21724, Compound 3
TypeSmall organic molecule
Emp. Form.C15H10O6
Mol. Mass.286.2363
SMILESOc1cc(O)c2c(c1)oc(cc2=O)-c1ccc(O)c(O)c1