Reaction Details
TargetPlasminogen activator inhibitor 1
LigandBDBM50310304
Substrate/Competitorn/a
Meas. Tech.ChEMBL_607975 (CHEMBL1072391)
IC50 343000±n/a nM
Citation El-Ayache, NCLi, SHWarnock, MLawrence, DAEmal, CD Novel bis-arylsulfonamides and aryl sulfonimides as inactivators of plasminogen activator inhibitor-1 (PAI-1). Bioorg Med Chem Lett20:966-70 (2010) 
 
Plasminogen activator inhibitor 1
Name:Plasminogen activator inhibitor 1
Type:Enzyme
Mol. Mass.:45064.00
Organism:Homo sapiens (Human)
Description:P05121
Residue:402
BDBM50310304
NameBDBM50310304
Synonyms:CHEMBL597510 | N,N'-(ethane-1,2-diyl)bis(N-ethyl-3-hydroxybenzenesulfonamide)
TypeSmall organic molecule
Emp. Form.C18H24N2O6S2
Mol. Mass.428.523
SMILESCCN(CCN(CC)S(=O)(=O)c1cccc(O)c1)S(=O)(=O)c1cccc(O)c1