Reaction Details
TargetAntithrombin-III
LigandBDBM50310305
Substrate/Competitorn/a
Meas. Tech.ChEMBL_607976 (CHEMBL1072392)
IC50>300000±n/a nM
Citation El-Ayache, NCLi, SHWarnock, MLawrence, DAEmal, CD Novel bis-arylsulfonamides and aryl sulfonimides as inactivators of plasminogen activator inhibitor-1 (PAI-1). Bioorg Med Chem Lett20:966-70 (2010) 
 
Antithrombin-III
Name:Antithrombin-III
Type:PROTEIN
Mol. Mass.:52602.34
Organism:Homo sapiens (Human)
Description:ChEMBL_35871
Residue:464
BDBM50310305
NameBDBM50310305
Synonyms:CHEMBL596859 | N,N'-(ethane-1,2-diyl)bis(N-ethyl-4-hydroxybenzenesulfonamide)
TypeSmall organic molecule
Emp. Form.C18H24N2O6S2
Mol. Mass.428.523
SMILESCCN(CCN(CC)S(=O)(=O)c1ccc(O)cc1)S(=O)(=O)c1ccc(O)cc1