Reaction Details
TargetAntithrombin-III
LigandBDBM50310309
Substrate/Competitorn/a
Meas. Tech.ChEMBL_607976 (CHEMBL1072392)
IC50>300000±n/a nM
Citation El-Ayache, NCLi, SHWarnock, MLawrence, DAEmal, CD Novel bis-arylsulfonamides and aryl sulfonimides as inactivators of plasminogen activator inhibitor-1 (PAI-1). Bioorg Med Chem Lett20:966-70 (2010) 
 
Antithrombin-III
Name:Antithrombin-III
Type:PROTEIN
Mol. Mass.:52602.34
Organism:Homo sapiens (Human)
Description:ChEMBL_35871
Residue:464
BDBM50310309
NameBDBM50310309
Synonyms:CHEMBL596879 | N-(3,4-dihydroxyphenylsulfonyl)-N-hexyl-3,4-dihydroxybenzenesulfonamide
TypeSmall organic molecule
Emp. Form.C18H23NO8S2
Mol. Mass.445.507
SMILESCCCCCCN(S(=O)(=O)c1ccc(O)c(O)c1)S(=O)(=O)c1ccc(O)c(O)c1