Reaction Details
TargetMelanocyte-stimulating hormone receptor
LigandBDBM50310317
Substrate/Competitorn/a
Meas. Tech.ChEMBL_608232 (CHEMBL1072421)
EC50 1000±n/a nM
Citation Ovadia, OLinde, YHaskell-Luevano, CDirain, MLSheynis, TJelinek, RGilon, CHoffman, A The effect of backbone cyclization on PK/PD properties of bioactive peptide-peptoid hybrids: the melanocortin agonist paradigm. Bioorg Med Chem18:580-9 (2010) 
 
Melanocyte-stimulating hormone receptor
Name:Melanocyte-stimulating hormone receptor
Type:PROTEIN
Mol. Mass.:35238.60
Organism:Mus musculus
Description:ChEMBL_1498846
Residue:315
BDBM50310317
NameBDBM50310317
Synonyms:2-((6S,9S,15S)-6-((1H-indol-3-yl)methyl)-13,15-dibenzyl-9-(3-guanidinopropyl)-5,8,11,14,17,21-hexaoxo-1,4,7,10,13,16-hexaazacyclohenicosan-4-yl)acetamide | CHEMBL602654
TypeSmall organic molecule
Emp. Form.C44H55N11O7
Mol. Mass.849.977
SMILESNC(=O)CN1CCNC(=O)CCCC(=O)N[C@@H](Cc2ccccc2)C(=O)N(Cc2ccccc2)CC(=O)N[C@@H](CCCN=C(N)N)C(=O)N[C@@H](Cc2c[nH]c3ccccc23)C1=O