Reaction Details
TargetPotassium voltage-gated channel subfamily H member 2
LigandBDBM50310644
Substrate/Competitorn/a
Meas. Tech.ChEMBL_620410 (CHEMBL1112305)
IC50 10300±n/a nM
Citation Wakenhut, FAllan, GAFish, PVFray, MJHarrison, ACMcCoy, RPhillips, SCRyckmans, TStobie, AWestbrook, DWestbrook, SLWhitlock, GA N-[(3S)-Pyrrolidin-3-yl]benzamides as novel dual serotonin and noradrenaline reuptake inhibitors: impact of small structural modifications on P-gp recognition and CNS penetration. Bioorg Med Chem Lett19:5078-81 (2009) 
 
Potassium voltage-gated channel subfamily H member 2
Name:Potassium voltage-gated channel subfamily H member 2
Type:Multi-pass membrane protein
Mol. Mass.:126672.65
Organism:Homo sapiens (Human)
Description:Q12809
Residue:1159
BDBM50310644
NameBDBM50310644
Synonyms:(S)-2,3-dichloro-N-cyclopentyl-N-(pyrrolidin-3-yl)benzamide | CHEMBL1080968
TypeSmall organic molecule
Emp. Form.C16H20Cl2N2O
Mol. Mass.327.249
SMILESClc1cccc(C(=O)N(C2CCCC2)[C@H]2CCNC2)c1Cl