Reaction Details
TargetCytochrome P450 2D6
LigandBDBM50310656
Substrate/Competitorn/a
Meas. Tech.ChEMBL_620420 (CHEMBL1112315)
IC50>30000±n/a nM
Citation Wakenhut, FAllan, GAFish, PVFray, MJHarrison, ACMcCoy, RPhillips, SCRyckmans, TStobie, AWestbrook, DWestbrook, SLWhitlock, GA N-[(3S)-Pyrrolidin-3-yl]benzamides as novel dual serotonin and noradrenaline reuptake inhibitors: impact of small structural modifications on P-gp recognition and CNS penetration. Bioorg Med Chem Lett19:5078-81 (2009) 
 
Cytochrome P450 2D6
Name:Cytochrome P450 2D6
Type:Protein
Mol. Mass.:55774.82
Organism:Homo sapiens (Human)
Description:P10635
Residue:497
BDBM50310656
NameBDBM50310656
Synonyms:(S)-2,3-dichloro-N-isobutyl-N-(pyrrolidin-3-yl)benzamide PF-18298 | PF-184298
TypeSmall organic molecule
Emp. Form.C15H20Cl2N2O
Mol. Mass.315.238
SMILESCC(C)CN([C@H]1CCNC1)C(=O)c1cccc(Cl)c1Cl