Reaction Details
TargetSodium-dependent serotonin transporter
LigandBDBM84745
Substrate/Competitorn/a
Meas. Tech.ChEMBL_620406 (CHEMBL1112301)
Ki 5±n/a nM
Citation Wakenhut, FAllan, GAFish, PVFray, MJHarrison, ACMcCoy, RPhillips, SCRyckmans, TStobie, AWestbrook, DWestbrook, SLWhitlock, GA N-[(3S)-Pyrrolidin-3-yl]benzamides as novel dual serotonin and noradrenaline reuptake inhibitors: impact of small structural modifications on P-gp recognition and CNS penetration. Bioorg Med Chem Lett19:5078-81 (2009) 
 
Sodium-dependent serotonin transporter
Name:Sodium-dependent serotonin transporter
Type:Multi-pass membrane protein
Mol. Mass.:70322.51
Organism:Homo sapiens (Human)
Description:P31645
Residue:630
BDBM84745
NameBDBM84745
Synonyms:CAS_136434-34-9 LY-248686 USRE49340, Rank 5
TypeSmall organic molecule
Emp. Form.C18H19NOS
Mol. Mass.297.415
SMILESCNCC[C@H](Oc1cccc2ccccc12)c1cccs1