Reaction Details
TargetSodium-dependent serotonin transporter
LigandBDBM50310646
Substrate/Competitorn/a
Meas. Tech.ChEMBL_620406 (CHEMBL1112301)
Ki 6±n/a nM
Citation Wakenhut, FAllan, GAFish, PVFray, MJHarrison, ACMcCoy, RPhillips, SCRyckmans, TStobie, AWestbrook, DWestbrook, SLWhitlock, GA N-[(3S)-Pyrrolidin-3-yl]benzamides as novel dual serotonin and noradrenaline reuptake inhibitors: impact of small structural modifications on P-gp recognition and CNS penetration. Bioorg Med Chem Lett19:5078-81 (2009) 
 
Sodium-dependent serotonin transporter
Name:Sodium-dependent serotonin transporter
Type:Multi-pass membrane protein
Mol. Mass.:70322.51
Organism:Homo sapiens (Human)
Description:P31645
Residue:630
BDBM50310646
NameBDBM50310646
Synonyms:(S)-2,3-dichloro-N-(2H-pyran-4-yl)-N-(pyrrolidin-3-yl)benzamide | CHEMBL1079263
TypeSmall organic molecule
Emp. Form.C16H16Cl2N2O2
Mol. Mass.339.216
SMILESClc1cccc(C(=O)N([C@H]2CCNC2)C2=CCOC=C2)c1Cl